-fPIC -Wall -DUSE_HPTZIP -DUNIX src/toss.c src/toss.c: In function ‘putMsgInArea’: src/toss.c:325:49: error: lvalue required as unary ‘&’ operand
&((unsigned int)textLength));
^
make: *** [makefile.inc:28: toss.o] Error 1
Hello Sean,
Thursday March 25 2021, Sean Rima wrote to All:
-fPIC -Wall -DUSE_HPTZIP -DUNIX src/toss.c src/toss.c: In functionFixed.
C€˜putMsgInAreaC€™: src/toss.c:325:49: error: lvalue required as unary
C€˜&C€™ operand
&((unsigned
int)textLength));
^
make: *** [makefile.inc:28: toss.o] Error 1
Sysop: | Gate Keeper |
---|---|
Location: | Shelby, NC |
Users: | 785 |
Nodes: | 20 (0 / 20) |
Uptime: | 212:34:33 |
Calls: | 11,917 |
Calls today: | 3 |
Files: | 5,294 |
D/L today: |
64 files (53,318K bytes) |
Messages: | 553,389 |